BDBM50180973 CHEMBL3819284
SMILES CCN([C@H]1CN(N=C1c1ccc(Cl)c(C)c1)C(\Nc1cccc(OC(F)F)c1)=N/C#N)C(=O)CO
InChI Key InChIKey=HRSYSGOOIRVSSD-IBGZPJMESA-N
Data  1 IC50
  Tab Delimited (TSV)   2D SDfile   Computed 3D by Vconf -m prep SDfile
Find this compound or compounds like it in BindingDB:
Activity Spreadsheet -- Enzyme Inhibition Constant Data from BindingDB
Found 1 hit for monomerid = 50180973
TargetN-lysine methyltransferase SMYD2(Homo sapiens (Human))
Bayer Pharma
Curated by ChEMBL
LigandPNGBDBM50180973(CHEMBL3819284)
Affinity DataIC50:  38nM. Assay description: Inhibition of SMYD2 (unknown origin) using H4 as substrate after 2hrs in presence 3H-SAM of by scintillation proximity assay
In DepthDetails ArticlePubMed