BDBM50181067 2-chloro-6-((2-methylpyridin-4-yl)methoxy)isonicotinonitrile::CHEMBL205146
SMILES Cc1cc(COc2cc(cc(Cl)n2)C#N)ccn1
InChI Key InChIKey=MWMMUKIHNXXNGW-UHFFFAOYSA-N
Data  1 KI
  Tab Delimited (TSV)   2D SDfile   Computed 3D by Vconf -m prep SDfile
Find this compound or compounds like it in BindingDB:
Activity Spreadsheet -- Enzyme Inhibition Constant Data from BindingDB
Found 1 hit for monomerid = 50181067
TargetMetabotropic glutamate receptor 5(Homo sapiens (Human))
F. Hoffmann-La Roche
Curated by ChEMBL
LigandPNGBDBM50181067(2-chloro-6-((2-methylpyridin-4-yl)methoxy)isonicot...)
Affinity DataKi:  10nM. Assay description: Displacement of [3H]MPEP from recombinant human mGlu5 receptor
In DepthDetails ArticlePubMed