BDBM50181078 CHEMBL206998::pentyl 3-(3-chlorobenzyloxy)-5-methylphenyl(methyl)carbamate
SMILES CCCCCOC(=O)N(C)c1cc(C)cc(OCc2cccc(Cl)c2)c1
InChI Key InChIKey=LDPOTMPWUSJJPA-UHFFFAOYSA-N
Data  1 KI
  Tab Delimited (TSV)   2D SDfile   Computed 3D by Vconf -m prep SDfile
Find this compound or compounds like it in BindingDB:
Activity Spreadsheet -- Enzyme Inhibition Constant Data from BindingDB
Found 1 hit for monomerid = 50181078
TargetMetabotropic glutamate receptor 5(Homo sapiens (Human))
F. Hoffmann-La Roche
Curated by ChEMBL
LigandPNGBDBM50181078(CHEMBL206998 | pentyl 3-(3-chlorobenzyloxy)-5-meth...)
Affinity DataKi:  33nM. Assay description: Displacement of [3H]MPEP from recombinant human mGlu5 receptor
In DepthDetails ArticlePubMed