BDBM50181439 CHEMBL3818211
SMILES [H][C@]1(C[C@H](C[C@H]1NC(N)=N)P(O)(=O)OCC)[C@@H](NC(C)=O)C(CC)CC
InChI Key InChIKey=KNIZOAOWVJJQQB-TUVASFSCSA-N
Data  1 IC50
  Tab Delimited (TSV)   2D SDfile   Computed 3D by Vconf -m prep SDfile
Find this compound or compounds like it in BindingDB:
Activity Spreadsheet -- Enzyme Inhibition Constant Data from BindingDB
Found 1 hit for monomerid = 50181439
TargetNeuraminidase(Influenza A virus)
National Taiwan University
Curated by ChEMBL
LigandPNGBDBM50181439(CHEMBL3818211)
Affinity DataIC50:  1nM. Assay description: Inhibition of oseltamivir-resistant Influenza A virus A/WSN/1933(H1N1) recombinant wild type neuraminidase transfected in HEK293 cells using MUNANA a...
In DepthDetails ArticlePubMed