BDBM50181444 CHEMBL3818436
SMILES [H][C@]1(C=C(C[C@H]1NC(N)=N)P(O)(O)=O)[C@@H](NC(C)=O)C(CC)CC
InChI Key InChIKey=ZJJHFLKRXOBYMQ-UPJWGTAASA-N
Data  8 IC50
  Tab Delimited (TSV)   2D SDfile   Computed 3D by Vconf -m prep SDfile
Find this compound or compounds like it in BindingDB:
Activity Spreadsheet -- Enzyme Inhibition Constant Data from BindingDB
Found 8 hits for monomerid = 50181444
TargetNeuraminidase(Influenza A virus)
National Taiwan University
Curated by ChEMBL
LigandPNGBDBM50181444(CHEMBL3818436)
Affinity DataIC50:  86nM. Assay description: Inhibition of Influenza A virus A/WSN/1933(H1N1) recombinant neuraminidase H275Y mutant transfected in HEK293 cells using MUNANA as substrate assesse...
In DepthDetails ArticlePubMed
TargetNeuraminidase(Influenza A virus)
National Taiwan University
Curated by ChEMBL
LigandPNGBDBM50181444(CHEMBL3818436)
Affinity DataIC50:  2.30nM. Assay description: Inhibition of Influenza A virus A/Brisbane/10/2007(H3N2) recombinant wild type neuraminidase transfected in HEK293 cells using MUNANA as substrate as...
In DepthDetails ArticlePubMed
TargetNeuraminidase(Influenza A virus)
National Taiwan University
Curated by ChEMBL
LigandPNGBDBM50181444(CHEMBL3818436)
Affinity DataIC50: >8.30E+4nM. Assay description: Inhibition of Influenza A virus A/Brisbane/10/2007(H3N2) recombinant neuraminidase E119A mutant transfected in HEK293 cells using MUNANA as substrate...
In DepthDetails ArticlePubMed
TargetNeuraminidase(Influenza A virus)
National Taiwan University
Curated by ChEMBL
LigandPNGBDBM50181444(CHEMBL3818436)
Affinity DataIC50:  4.10nM. Assay description: Inhibition of Influenza A virus A/Shanghai/01/2014(H7N9) recombinant wild type neuraminidase transfected in HEK293 cells using MUNANA as substrate as...
In DepthDetails ArticlePubMed
TargetNeuraminidase(Influenza A virus)
National Taiwan University
Curated by ChEMBL
LigandPNGBDBM50181444(CHEMBL3818436)
Affinity DataIC50:  0.300nM. Assay description: Inhibition of oseltamivir-resistant Influenza A virus A/Vietnam/1194/2004(H5N1) recombinant wild type neuraminidase transfected in HEK293 cells using...
In DepthDetails ArticlePubMed
TargetNeuraminidase(Influenza A virus)
National Taiwan University
Curated by ChEMBL
LigandPNGBDBM50181444(CHEMBL3818436)
Affinity DataIC50:  73nM. Assay description: Inhibition of oseltamivir-resistant Influenza A virus A/Vietnam/1194/2004(H5N1) recombinant neuraminidase H275Y mutant transfected in HEK293 cells us...
In DepthDetails ArticlePubMed
TargetNeuraminidase(Influenza A virus)
National Taiwan University
Curated by ChEMBL
LigandPNGBDBM50181444(CHEMBL3818436)
Affinity DataIC50:  0.300nM. Assay description: Inhibition of oseltamivir-resistant Influenza A virus A/WSN/1933(H1N1) recombinant wild type neuraminidase transfected in HEK293 cells using MUNANA a...
In DepthDetails ArticlePubMed
TargetNeuraminidase(Influenza A virus)
National Taiwan University
Curated by ChEMBL
LigandPNGBDBM50181444(CHEMBL3818436)
Affinity DataIC50:  2.13E+3nM. Assay description: Inhibition of Influenza A virus A/Brisbane/10/2007(H3N2) recombinant neuraminidase R292K mutant transfected in HEK293 cells using MUNANA as substrate...
In DepthDetails ArticlePubMed