BDBM50181671 5-benzo[1,3]dioxol-5-yl-2-oxo-1,2-dihydro-pyridine-3-carboxylic acid methyl-[4-(4-methyl-piperazin-1-ylmethyl)-phenyl]-amide::CHEMBL201638
SMILES CN(C(=O)c1cc(c[nH]c1=O)-c1ccc2OCOc2c1)c1ccc(CN2CCN(C)CC2)cc1
InChI Key InChIKey=CIODCVKOSCDFBC-UHFFFAOYSA-N
Data  2 IC50
  Tab Delimited (TSV)   2D SDfile   Computed 3D by Vconf -m prep SDfile
Find this compound or compounds like it in BindingDB:
Activity Spreadsheet -- Enzyme Inhibition Constant Data from BindingDB
Found 2 hits for monomerid = 50181671
TargetALK tyrosine kinase receptor(Homo sapiens (Human))
Chembridge Research Laboratories And Chembridge
Curated by ChEMBL
LigandPNGBDBM50181671(5-benzo[1,3]dioxol-5-yl-2-oxo-1,2-dihydro-pyridine...)
Affinity DataIC50:  3.70E+3nM. Assay description: Inhibitory activity against ALK
In DepthDetails ArticlePubMed
TargetInsulin receptor(Homo sapiens (Human))
Chembridge Research Laboratories And Chembridge
Curated by ChEMBL
LigandPNGBDBM50181671(5-benzo[1,3]dioxol-5-yl-2-oxo-1,2-dihydro-pyridine...)
Affinity DataIC50:  3.25E+4nM. Assay description: Inhibitory activity against IRK
In DepthDetails ArticlePubMed