BDBM50181866 CHEMBL3819638
SMILES Nc1nc2[nH]c(SCc3ccccc3Br)nc2c(=O)[nH]1
InChI Key InChIKey=VJAPWTRZDSQVKX-UHFFFAOYSA-N
Data  2 Kd
  Tab Delimited (TSV)   2D SDfile   Computed 3D by Vconf -m prep SDfile
Find this compound or compounds like it in BindingDB:
Activity Spreadsheet -- Enzyme Inhibition Constant Data from BindingDB
Found 2 hits for monomerid = 50181866
Target2-amino-4-hydroxy-6-hydroxymethyldihydropteridine diphosphokinase(Staphylococcus aureus)
Monash University
Curated by ChEMBL
LigandPNGBDBM50181866(CHEMBL3819638)
Affinity DataKd:  1.50E+3nM. Assay description: Binding affinity to biotinylated Staphylococcus aureus HPPK in presence of 1 mM ATP by SPR assay
In DepthDetails ArticlePubMed
Target2-amino-4-hydroxy-6-hydroxymethyldihydropteridine pyrophosphokinase(Escherichia coli (strain K12))
Monash University
Curated by ChEMBL
LigandPNGBDBM50181866(CHEMBL3819638)
Affinity DataKd:  8.50E+3nM. Assay description: Binding affinity to biotinylated Escherichia coli HPPK expressed in Escherichia coli BL21 (DE3) in presence of 1 mM ATP by SPR assay
In DepthDetails ArticlePubMed