BDBM50181944 2-(4-(4-chlorobenzyloxy)phenyl)-1-cyclopentyl-1H-benzo[d]imidazole-5-carboxylic acid::CHEMBL381318
SMILES OC(=O)c1ccc2n(C3CCCC3)c(nc2c1)-c1ccc(OCc2ccc(Cl)cc2)cc1
InChI Key InChIKey=UVYUPWDVOAYOLH-UHFFFAOYSA-N
Data  1 IC50
  Tab Delimited (TSV)   2D SDfile   Computed 3D by Vconf -m prep SDfile
Find this compound or compounds like it in BindingDB:
Activity Spreadsheet -- Enzyme Inhibition Constant Data from BindingDB
Found 1 hit for monomerid = 50181944
TargetRNA-directed RNA polymerase(Hepatitis C virus)
Central Pharmaceutical Research Institute
Curated by ChEMBL
LigandPNGBDBM50181944(2-(4-(4-chlorobenzyloxy)phenyl)-1-cyclopentyl-1H-b...)
Affinity DataIC50:  1.20E+3nM. Assay description: Inhibitory activity against HCV 1b NS5B RNA dependent RNA polymerase
In DepthDetails ArticlePubMed