BDBM50182015 CHEMBL206322::N-(2-methoxyphenyl)-7-(pyridin-2-yl)-7H-pyrrolo[2,3-d]pyrimidin-2-amine
SMILES COc1ccccc1Nc1ncc2ccn(-c3ccccn3)c2n1
InChI Key InChIKey=MCHZVJWHJZVLBG-UHFFFAOYSA-N
Data  1 IC50
  Tab Delimited (TSV)   2D SDfile   Computed 3D by Vconf -m prep SDfile
Find this compound or compounds like it in BindingDB:
Activity Spreadsheet -- Enzyme Inhibition Constant Data from BindingDB
Found 1 hit for monomerid = 50182015
TargetFocal adhesion kinase 1(Homo sapiens (Human))
Genomics Institute Of The Novartis Research Foundation
Curated by ChEMBL
LigandPNGBDBM50182015(CHEMBL206322 | N-(2-methoxyphenyl)-7-(pyridin-2-yl...)
Affinity DataIC50:  700nM. Assay description: Inhibitory activity against FAK
In DepthDetails ArticlePubMed