BDBM50182018 7-(2-chloropyrimidin-4-yl)-N-(3,4,5-trimethoxyphenyl)-7H-pyrrolo[2,3-d]pyrimidin-2-amine::CHEMBL383672
SMILES COc1cc(Nc2ncc3ccn(-c4ccnc(Cl)n4)c3n2)cc(OC)c1OC
InChI Key InChIKey=VDZGQQGOQLBMJT-UHFFFAOYSA-N
Data  1 IC50
  Tab Delimited (TSV)   2D SDfile   Computed 3D by Vconf -m prep SDfile
Find this compound or compounds like it in BindingDB:
Activity Spreadsheet -- Enzyme Inhibition Constant Data from BindingDB
Found 1 hit for monomerid = 50182018
TargetFocal adhesion kinase 1(Homo sapiens (Human))
Genomics Institute Of The Novartis Research Foundation
Curated by ChEMBL
LigandPNGBDBM50182018(7-(2-chloropyrimidin-4-yl)-N-(3,4,5-trimethoxyphen...)
Affinity DataIC50:  800nM. Assay description: Inhibitory activity against FAK
In DepthDetails ArticlePubMed