BDBM50182085 2-(2-(5-bromo-2-methoxyphenethyl)-3-chlorophenyl)-4,5-dihydro-1H-imidazole::CHEMBL205912
SMILES COc1ccc(Br)cc1CCc1c(Cl)cccc1C1=NCCN1
InChI Key InChIKey=UPKKORHDOYVZHW-UHFFFAOYSA-N
Data  1 KI
  Tab Delimited (TSV)   2D SDfile   Computed 3D by Vconf -m prep SDfile
Find this compound or compounds like it in BindingDB:
Activity Spreadsheet -- Enzyme Inhibition Constant Data from BindingDB
Found 1 hit for monomerid = 50182085
TargetPotassium voltage-gated channel subfamily H member 2(Homo sapiens (Human))
Millennium Pharmaceuticals
Curated by ChEMBL
LigandPNGBDBM50182085(2-(2-(5-bromo-2-methoxyphenethyl)-3-chlorophenyl)-...)
Affinity DataKi:  840nM. Assay description: Binding affinity to hERG
In DepthDetails ArticlePubMed