BDBM50182407 5-Hydroxyquinoline::CHEBI:48993::CHEMBL589127
SMILES Oc1cccc2ncccc12
InChI Key InChIKey=GYESAYHWISMZOK-UHFFFAOYSA-N
Data  1 Kd
PDB links: 1 PDB ID matches this monomer.
  Tab Delimited (TSV)   2D SDfile   Computed 3D by Vconf -m prep SDfile
Find this compound or compounds like it in BindingDB:
Activity Spreadsheet -- Enzyme Inhibition Constant Data from BindingDB
Found 1 hit for monomerid = 50182407
TargetPeregrin(Homo sapiens (Human))
University Of Z£Rich
Curated by ChEMBL
LigandPNGBDBM50182407(5-Hydroxyquinoline | CHEBI:48993 | CHEMBL589127)
Affinity DataKd: >2.00E+5nM. Assay description: Binding affinity to recombinant GST-tagged human BRPF1 expressed in Escherichia coli BL21 (DE3) after 1 hr by qPCR-based BromoScan assay