BDBM50182412 CHEMBL3818285
SMILES C[C@@H]1Nc2ccccc2NC1=O
InChI Key InChIKey=BEAJCHFCYQOFGS-LURJTMIESA-N
Data  1 Kd
PDB links: 1 PDB ID matches this monomer.
  Tab Delimited (TSV)   2D SDfile   Computed 3D by Vconf -m prep SDfile
Find this compound or compounds like it in BindingDB:
Activity Spreadsheet -- Enzyme Inhibition Constant Data from BindingDB
Found 1 hit for monomerid = 50182412
TargetPeregrin(Homo sapiens (Human))
University Of Z£Rich
Curated by ChEMBL
LigandPNGBDBM50182412(CHEMBL3818285)
Affinity DataKd:  9.10E+4nM. Assay description: Binding affinity to recombinant GST-tagged human BRPF1 expressed in Escherichia coli BL21 (DE3) after 1 hr by qPCR-based BromoScan assay