BDBM50182418 CHEBI:81783::TRICYCLAZOLE
SMILES Cc1cccc2sc3nncn3c12
InChI Key InChIKey=DQJCHOQLCLEDLL-UHFFFAOYSA-N
Data  1 Kd
  Tab Delimited (TSV)   2D SDfile   Computed 3D by Vconf -m prep SDfile
Find this compound or compounds like it in BindingDB:
Activity Spreadsheet -- Enzyme Inhibition Constant Data from BindingDB
Found 1 hit for monomerid = 50182418
TargetPeregrin(Homo sapiens (Human))
University Of Z£Rich
Curated by ChEMBL
LigandPNGBDBM50182418(CHEBI:81783 | TRICYCLAZOLE)
Affinity DataKd:  2.10E+4nM. Assay description: Binding affinity to recombinant GST-tagged human BRPF1 expressed in Escherichia coli BL21 (DE3) after 1 hr by qPCR-based BromoScan assay
In DepthDetails ArticlePubMed