BDBM50182443 CHEMBL3819646
SMILES Oc1ccc2C(=O)\C(Cc2c1)=C\C1CCN(Cc2ccccc2)CC1
InChI Key InChIKey=PIJDCHBRSITJLS-XDHOZWIPSA-N
Data  2 KI  3 IC50
  Tab Delimited (TSV)   2D SDfile   Computed 3D by Vconf -m prep SDfile
Find this compound or compounds like it in BindingDB:
Activity Spreadsheet -- Enzyme Inhibition Constant Data from BindingDB
Found 5 hits for monomerid = 50182443
TargetAcetylcholinesterase(Homo sapiens (Human))
Universit£
Curated by ChEMBL
LigandPNGBDBM50182443(CHEMBL3819646)
Affinity DataKi:  1.98E+3nM. Assay description: Non-competitive inhibition of human erythrocytes AchE using acetylthiocholine iodide as substrate incubated for 20 mins by Lineweaver-Burk plot analy...
In DepthDetails ArticlePubMed
TargetCholinesterase(Equus caballus (Horse))
Universit£
Curated by ChEMBL
LigandPNGBDBM50182443(CHEMBL3819646)
Affinity DataKi:  8.46E+3nM. Assay description: Mixed inhibition of horse serum BuChE using butyrylthiocoline iodide as substrate incubated for 20 mins by Lineweaver-Burk plot analysis
In DepthDetails ArticlePubMed
TargetAcetylcholinesterase(Homo sapiens (Human))
Universit£
Curated by ChEMBL
LigandPNGBDBM50182443(CHEMBL3819646)
Affinity DataIC50:  2.16E+3nM. Assay description: Inhibition of human erythrocytes AchE using acetylthiocholine iodide as substrate incubated for 20 mins by Ellman method
In DepthDetails ArticlePubMed
TargetBeta-secretase 1(Mus musculus (Mouse))
Universit£
Curated by ChEMBL
LigandPNGBDBM50182443(CHEMBL3819646)
Affinity DataIC50: <1.00E+3nM. Assay description: Inhibition of mouse BACE-1 preincubated for 10 mins followed by fluorescent peptide substrate addition measured for 30 mins by fluorescence plate rea...
In DepthDetails ArticlePubMed
TargetCholinesterase(Equus caballus (Horse))
Universit£
Curated by ChEMBL
LigandPNGBDBM50182443(CHEMBL3819646)
Affinity DataIC50:  7.59E+3nM. Assay description: Inhibition of horse serum BuChE using butyrylthiocoline iodide as substrate incubated for 20 mins by Ellman method
In DepthDetails ArticlePubMed