BDBM50182449 CHEMBL3819573
SMILES O[C@@H]1C=C(C[C@@H](OCc2ccc3ccccc3c2)[C@@H]1O)C(O)=O
InChI Key InChIKey=GJHLDGXJKDDNLQ-BRWVUGGUSA-N
Data  1 KI
  Tab Delimited (TSV)   2D SDfile   Computed 3D by Vconf -m prep SDfile
Find this compound or compounds like it in BindingDB:
Activity Spreadsheet -- Enzyme Inhibition Constant Data from BindingDB
Found 1 hit for monomerid = 50182449
TargetShikimate kinase(Helicobacter pylori (strain ATCC 700392 / 26695) (...)
Universidade De Santiago De Compostela
Curated by ChEMBL
LigandPNGBDBM50182449(CHEMBL3819573)
Affinity DataKi:  1.80E+3nM. Assay description: Inhibition of Helicobacter pylori shikimate kinase using shikimic acid substrate by measuring oxidation of NADH to NAD by pyruvate kinase and lactate...
In DepthDetails ArticlePubMed