BDBM50182488 CHEMBL3819036
SMILES Oc1ccc(CCCCCCCCC(=O)c2c(O)cc(O)cc2O)cc1
InChI Key InChIKey=XNMKFKNNXSUXRV-UHFFFAOYSA-N
Data  4 IC50
  Tab Delimited (TSV)   2D SDfile   Computed 3D by Vconf -m prep SDfile
Find this compound or compounds like it in BindingDB:
Activity Spreadsheet -- Enzyme Inhibition Constant Data from BindingDB
Found 4 hits for monomerid = 50182488
TargetAcetylcholinesterase(Homo sapiens (Human))
University Of Malaya
Curated by ChEMBL
LigandPNGBDBM50182488(CHEMBL3819036)
Affinity DataIC50:  6.44E+3nM. Assay description: Inhibition of AChE (unknown origin) using acetylthiocholine iodide as substrate incubated for 30 mins by Ellman's microplate assay
In DepthDetails ArticlePubMed
TargetPhosphatidylcholine:ceramide cholinephosphotransferase 1(Homo sapiens (Human))
Hokkaido University
Curated by ChEMBL
LigandPNGBDBM50182488(CHEMBL3819036)
Affinity DataIC50:  6.00E+3nM. Assay description: Inhibition of SMS1 (unknown origin) stably expressed in mouse ZS cells using C6-NBD-ceramide as substrate preincubated for 30 mins followed by substr...
In DepthDetails ArticlePubMed
TargetPhosphatidylcholine:ceramide cholinephosphotransferase 2(Homo sapiens (Human))
Hokkaido University
Curated by ChEMBL
LigandPNGBDBM50182488(CHEMBL3819036)
Affinity DataIC50:  4.50E+3nM. Assay description: Inhibition of SMS2 (unknown origin) stably expressed in mouse ZS cells using C6-NBD-ceramide as substrate preincubated for 30 mins followed by substr...
In DepthDetails ArticlePubMed
TargetCholinesterase(Equus caballus (Horse))
University Of Malaya
Curated by ChEMBL
LigandPNGBDBM50182488(CHEMBL3819036)
Affinity DataIC50:  6.65E+3nM. Assay description: Inhibition of equine serum BChE using S-butyrylthiocholine chloride as substrate incubated for 30 mins by Ellman's microplate assay
In DepthDetails ArticlePubMed