BDBM50182528 CHEMBL3818743::US9512121, 7
SMILES [H][C@@]12CCCN1c1cnc3ccc(Sc4nnc5c(F)cc(cn45)-c4cnn(C)c4)cc3c1OC2
InChI Key InChIKey=AVLLGHFOBOLCPF-INIZCTEOSA-N
Data  2 IC50
  Tab Delimited (TSV)   2D SDfile   Computed 3D by Vconf -m prep SDfile
Find this compound or compounds like it in BindingDB:
Activity Spreadsheet -- Enzyme Inhibition Constant Data from BindingDB
Found 2 hits for monomerid = 50182528
TargetHepatocyte growth factor receptor(Homo sapiens (Human))
Southeast University
Curated by ChEMBL
LigandPNGBDBM50182528(CHEMBL3818743 | US9512121, 7)
Affinity DataIC50:  123nM. Assay description: Inhibition of c-Met (unknown origin) incubated for 1 hr by spectrophotometric analysis
In DepthDetails ArticlePubMed
TargetHepatocyte growth factor receptor(Homo sapiens (Human))
Southeast University
Curated by ChEMBL
LigandPNGBDBM50182528(CHEMBL3818743 | US9512121, 7)
Affinity DataIC50:  123nMT: 2°C. Assay description: Experimental Purpose: The purpose is to study the effect of the compounds on c-MET tyrosine kinase activity at the molecular level. IC50 values were ...
In DepthDetails US Patent