BDBM50182656 3-{4-[1-(1-cyclopropyl-3-carboxy-4-oxo-6-fluoro-7-quinolyl)-4-(3-methylpiperazinyl)]butyl}-6-(3-ethyl-4-methylanilino)uracil::CHEMBL204187
SMILES CCc1cc(Nc2cc(=O)n(CCCCN3CCN(CC3C)c3cc4n(cc(C(O)=O)c(=O)c4cc3F)C3CC3)c(=O)[nH]2)ccc1C
InChI Key InChIKey=CFXOKKSZPDFENA-UHFFFAOYSA-N
Data  1 KI
  Tab Delimited (TSV)   2D SDfile   Computed 3D by Vconf -m prep SDfile
Find this compound or compounds like it in BindingDB:
Activity Spreadsheet -- Enzyme Inhibition Constant Data from BindingDB
Found 1 hit for monomerid = 50182656
TargetDNA polymerase III PolC-type(Bacillus subtilis)
Glsynthesis
Curated by ChEMBL
LigandPNGBDBM50182656(3-{4-[1-(1-cyclopropyl-3-carboxy-4-oxo-6-fluoro-7-...)
Affinity DataKi:  26nM. Assay description: Binding affinity to Bacillus subtilis DNA polymerase3C
In DepthDetails ArticlePubMed