BDBM50182667 3-{4-[1-(1-cyclopropyl-3-carboxy-4-oxo-6,8-difluoro-7-quinolyl)-4-(3-hydroxymethylpiperazinyl)]butyl}-6-(3-ethyl-4-methylanilino)uracil::CHEMBL202534
SMILES CCc1cc(Nc2cc(=O)n(CCCCN3CCN(CC3CO)c3c(F)cc4c(c3F)n(cc(C(O)=O)c4=O)C3CC3)c(=O)[nH]2)ccc1C
InChI Key InChIKey=XHSSTBPTQHSWCP-UHFFFAOYSA-N
Data  1 KI
  Tab Delimited (TSV)   2D SDfile   Computed 3D by Vconf -m prep SDfile
Find this compound or compounds like it in BindingDB:
Activity Spreadsheet -- Enzyme Inhibition Constant Data from BindingDB
Found 1 hit for monomerid = 50182667
TargetDNA polymerase III PolC-type(Bacillus subtilis)
Glsynthesis
Curated by ChEMBL
LigandPNGBDBM50182667(3-{4-[1-(1-cyclopropyl-3-carboxy-4-oxo-6,8-difluor...)
Affinity DataKi:  11nM. Assay description: Binding affinity to Bacillus subtilis DNA polymerase3C
In DepthDetails ArticlePubMed