BDBM50182747 CHEMBL3818994
SMILES Fc1ccc(cc1)C(=O)CCCN1CCc2ccccc2C1
InChI Key InChIKey=NMALCZJKSYZTRE-UHFFFAOYSA-N
Data  9 KI
  Tab Delimited (TSV)   2D SDfile   Computed 3D by Vconf -m prep SDfile
Find this compound or compounds like it in BindingDB:
Activity Spreadsheet -- Enzyme Inhibition Constant Data from BindingDB
Found 9 hits for monomerid = 50182747
TargetD(4) dopamine receptor(RAT)
Florida A&M University
Curated by ChEMBL
LigandPNGBDBM50182747(CHEMBL3818994)
Affinity DataKi:  2.30nM. Assay description: Displacement of [3H]N-methylspiperone from rat D4 receptor expressed in cell membranes after 1 hr by liquid scintillation counting
In DepthDetails ArticlePubMed
Target5-hydroxytryptamine receptor 1A(Homo sapiens (Human))
Florida A&M University
Curated by ChEMBL
LigandPNGBDBM50182747(CHEMBL3818994)
Affinity DataKi:  12nM. Assay description: Displacement of [3H]8-OH-DPAT from human 5-HT1A receptor expressed in cell membranes after 1 hr by liquid scintillation counting
In DepthDetails ArticlePubMed
Target5-hydroxytryptamine receptor 2A(Homo sapiens (Human))
Florida A&M University
Curated by ChEMBL
LigandPNGBDBM50182747(CHEMBL3818994)
Affinity DataKi:  14nM. Assay description: Displacement of [3H]Ketanserin from human 5-HT2A receptor expressed in cell membranes after 1 hr by liquid scintillation counting
In DepthDetails ArticlePubMed
TargetD(2) dopamine receptor(Homo sapiens (Human))
Florida A&M University
Curated by ChEMBL
LigandPNGBDBM50182747(CHEMBL3818994)
Affinity DataKi:  49nM. Assay description: Displacement of [3H]N-methylspiperone from human D2 receptor expressed in cell membranes after 1 hr by liquid scintillation counting
In DepthDetails ArticlePubMed
TargetD(3) dopamine receptor(Homo sapiens (Human))
Florida A&M University
Curated by ChEMBL
LigandPNGBDBM50182747(CHEMBL3818994)
Affinity DataKi:  72nM. Assay description: Displacement of [3H]N-methylspiperone from human D3 receptor expressed in cell membranes after 1 hr by liquid scintillation counting
In DepthDetails ArticlePubMed
TargetHistamine H1 receptor(Homo sapiens (Human))
Florida A&M University
Curated by ChEMBL
LigandPNGBDBM50182747(CHEMBL3818994)
Affinity DataKi:  86nM. Assay description: Displacement of [3H]Pyrilamine from human H1 receptor expressed in cell membranes after 1 hr by liquid scintillation counting
In DepthDetails ArticlePubMed
Target5-hydroxytryptamine receptor 7(Homo sapiens (Human))
Florida A&M University
Curated by ChEMBL
LigandPNGBDBM50182747(CHEMBL3818994)
Affinity DataKi:  364nM. Assay description: Displacement of [3H]LSD from human 5-HT7 receptor expressed in cell membranes after 1 hr by liquid scintillation counting
In DepthDetails ArticlePubMed
Target5-hydroxytryptamine receptor 2B(Homo sapiens (Human))
Florida A&M University
Curated by ChEMBL
LigandPNGBDBM50182747(CHEMBL3818994)
Affinity DataKi:  614nM. Assay description: Displacement of [3H]LSD from human 5-HT2B receptor expressed in cell membranes after 1 hr by liquid scintillation counting
In DepthDetails ArticlePubMed
Target5-hydroxytryptamine receptor 2C(Rattus norvegicus (Rat))
Florida A&M University
Curated by ChEMBL
LigandPNGBDBM50182747(CHEMBL3818994)
Affinity DataKi: >1.00E+4nM. Assay description: Displacement of [3H]Mesulergine from rat 5-HT2C receptor expressed in cell membranes after 1 hr by liquid scintillation counting
In DepthDetails ArticlePubMed