BDBM50183094 4-methyl-N-(naphthalen-1-yl)thiazol-2-amine::CHEMBL383736
SMILES Cc1csc(Nc2cccc3ccccc23)n1
InChI Key InChIKey=QNKLFDFMOINNIW-UHFFFAOYSA-N
Data  3 IC50
  Tab Delimited (TSV)   2D SDfile   Computed 3D by Vconf -m prep SDfile
Find this compound or compounds like it in BindingDB:
Activity Spreadsheet -- Enzyme Inhibition Constant Data from BindingDB
Found 3 hits for monomerid = 50183094
TargetC-C chemokine receptor type 4(Homo sapiens (Human))
Amgen
Curated by ChEMBL
LigandPNGBDBM50183094(4-methyl-N-(naphthalen-1-yl)thiazol-2-amine | CHEM...)
Affinity DataIC50:  3.00E+3nM. Assay description: Displacement of [125I]MDC from CCR4 expressed in human CEM cell line
In DepthDetails ArticlePubMed
TargetC-C chemokine receptor type 4(Homo sapiens (Human))
Amgen
Curated by ChEMBL
LigandPNGBDBM50183094(4-methyl-N-(naphthalen-1-yl)thiazol-2-amine | CHEM...)
Affinity DataIC50:  6.40E+3nM. Assay description: Inhibition of TARC-mediated CEM cell migration
In DepthDetails ArticlePubMed
TargetC-C chemokine receptor type 4(Homo sapiens (Human))
Amgen
Curated by ChEMBL
LigandPNGBDBM50183094(4-methyl-N-(naphthalen-1-yl)thiazol-2-amine | CHEM...)
Affinity DataIC50:  1.70E+3nM. Assay description: Displacement of [125I]TARC from CCR4 expressed in human CEM cell line
In DepthDetails ArticlePubMed