BDBM50183113 4-tert-butyl-N-(naphthalen-1-yl)oxazol-2-amine::CHEMBL206878
SMILES CC(C)(C)c1coc(Nc2cccc3ccccc23)n1
InChI Key InChIKey=RDWFLGKWZJPVFQ-UHFFFAOYSA-N
Data  1 IC50
  Tab Delimited (TSV)   2D SDfile   Computed 3D by Vconf -m prep SDfile
Find this compound or compounds like it in BindingDB:
Activity Spreadsheet -- Enzyme Inhibition Constant Data from BindingDB
Found 1 hit for monomerid = 50183113
TargetC-C chemokine receptor type 4(Homo sapiens (Human))
Amgen
Curated by ChEMBL
LigandPNGBDBM50183113(4-tert-butyl-N-(naphthalen-1-yl)oxazol-2-amine | C...)
Affinity DataIC50:  80nM. Assay description: Displacement of [125I]TARC from CCR4 expressed in human CEM cell line
In DepthDetails ArticlePubMed