BDBM50183181 CHEMBL208053::naphthalen-1-yl-[4-(2-pyrrolidin-1-yl-ethoxy)-phenyl]-methanone
SMILES O=C(c1ccc(OCCN2CCCC2)cc1)c1cccc2ccccc12
InChI Key InChIKey=VDFZAJZVBVLHFV-UHFFFAOYSA-N
Data  1 IC50
  Tab Delimited (TSV)   2D SDfile   Computed 3D by Vconf -m prep SDfile
Find this compound or compounds like it in BindingDB:
Activity Spreadsheet -- Enzyme Inhibition Constant Data from BindingDB
Found 1 hit for monomerid = 50183181
TargetGlucagon receptor(Homo sapiens (Human))
Central Drug Research Institute
Curated by ChEMBL
LigandPNGBDBM50183181(CHEMBL208053 | naphthalen-1-yl-[4-(2-pyrrolidin-1-...)
Affinity DataIC50:  5.50E+4nM. Assay description: Inhibition of [125I]glucagon binding to glucagon receptor
In DepthDetails ArticlePubMed