BDBM50183269 CHEMBL3818726
SMILES Cc1nc2c(N)ncnc2n1[C@@H]1O[C@H](COP(O)(=O)O[C@@H]2[C@H](O)[C@@H](COP(O)(=O)O[C@@H]3[C@H](O)[C@@H](COP(O)(=O)O[C@@H]4[C@@H](CO)O[C@H]([C@@H]4O)n4cnc5c(N)ncnc45)O[C@H]3n3cnc4c(N)ncnc34)O[C@H]2n2cnc3c(N)ncnc23)[C@@H](O)[C@H]1O
InChI Key InChIKey=BRIHAACKPPOGFX-LIRFIBJLSA-N
Data  1 EC50
  Tab Delimited (TSV)   2D SDfile   Computed 3D by Vconf -m prep SDfile
Find this compound or compounds like it in BindingDB:
Activity Spreadsheet -- Enzyme Inhibition Constant Data from BindingDB
Found 1 hit for monomerid = 50183269
Target2-5A-dependent ribonuclease(Homo sapiens (Human))
Gifu University
Curated by ChEMBL
LigandPNGBDBM50183269(CHEMBL3818726)
Affinity DataEC50:  20nM. Assay description: Induction of recombinant human RNase L activity expressed in Escherichia coli using F-5'-r(C11U2C7)-3' as substrate by polyacrylamide gel electrophor...
In DepthDetails ArticlePubMed