BDBM50183536 (R)-(-)-4-(2-benzhydryloxyethyl)-1-(3-phenylpropan-2-ol)-piperidine oxalate::CHEMBL382783
SMILES O[C@@H](CN1CCC(CCOC(c2ccccc2)c2ccccc2)CC1)Cc1ccccc1
InChI Key InChIKey=IQMIXHLHNCHBNI-MUUNZHRXSA-N
Data  3 KI
  Tab Delimited (TSV)   2D SDfile   Computed 3D by Vconf -m prep SDfile
Find this compound or compounds like it in BindingDB:
Activity Spreadsheet -- Enzyme Inhibition Constant Data from BindingDB
Found 3 hits for monomerid = 50183536
TargetSodium-dependent dopamine transporter(Homo sapiens (Human))
Niddk
Curated by ChEMBL
LigandPNGBDBM50183536((R)-(-)-4-(2-benzhydryloxyethyl)-1-(3-phenylpropan...)
Affinity DataKi:  6.90nM. Assay description: Displacement of [125I]RTI-55 from DAT
In DepthDetails ArticlePubMed
TargetSodium-dependent serotonin transporter(Homo sapiens (Human))
Niddk
Curated by ChEMBL
LigandPNGBDBM50183536((R)-(-)-4-(2-benzhydryloxyethyl)-1-(3-phenylpropan...)
Affinity DataKi:  286nM. Assay description: Displacement of [125I]RTI-55 from SERT
In DepthDetails ArticlePubMed
TargetSodium-dependent noradrenaline transporter(Homo sapiens (Human))
Niddk
Curated by ChEMBL
LigandPNGBDBM50183536((R)-(-)-4-(2-benzhydryloxyethyl)-1-(3-phenylpropan...)
Affinity DataKi:  785nM. Assay description: Displacement of [3H]nisoxetine from NET
In DepthDetails ArticlePubMed