BDBM50183598 (rac)-6-methyl-3,4-dihydro-2H-chromen-4-ol::CHEMBL204019
SMILES Cc1ccc2OCCC(O)c2c1
InChI Key InChIKey=IOWHBWAURDUJKJ-UHFFFAOYSA-N
Data  4 KI
  Tab Delimited (TSV)   2D SDfile   Computed 3D by Vconf -m prep SDfile
Find this compound or compounds like it in BindingDB:
Activity Spreadsheet -- Enzyme Inhibition Constant Data from BindingDB
Found 4 hits for monomerid = 50183598
TargetUDP-glucuronosyltransferase 2B7(Homo sapiens (Human))
University Of Helsinki
Curated by ChEMBL
LigandPNGBDBM50183598((rac)-6-methyl-3,4-dihydro-2H-chromen-4-ol | CHEMB...)
Affinity DataKi:  1.13E+5nM. Assay description: Competitive inhibition of UGT2B7-catalyzed scopoletin glucuronidation
In DepthDetails ArticlePubMed
TargetUDP-glucuronosyltransferase 2B17(Homo sapiens (Human))
University Of Helsinki
Curated by ChEMBL
LigandPNGBDBM50183598((rac)-6-methyl-3,4-dihydro-2H-chromen-4-ol | CHEMB...)
Affinity DataKi:  2.01E+5nM. Assay description: Competitive inhibition of UGT2B17-catalyzed scopoletin glucuronidation
In DepthDetails ArticlePubMed
TargetUDP-glucuronosyltransferase 2B7(Homo sapiens (Human))
University Of Helsinki
Curated by ChEMBL
LigandPNGBDBM50183598((rac)-6-methyl-3,4-dihydro-2H-chromen-4-ol | CHEMB...)
Affinity DataKi:  2.58E+5nM. Assay description: Non competitive inhibition of UGT2B7-catalyzed scopoletin glucuronidation
In DepthDetails ArticlePubMed
TargetUDP-glucuronosyltransferase 2B17(Homo sapiens (Human))
University Of Helsinki
Curated by ChEMBL
LigandPNGBDBM50183598((rac)-6-methyl-3,4-dihydro-2H-chromen-4-ol | CHEMB...)
Affinity DataKi:  6.08E+5nM. Assay description: Non competitive inhibition of UGT2B17-catalyzed scopoletin glucuronidation
In DepthDetails ArticlePubMed