BDBM50183610 (+/-)-(R)-6-Methyl-1-indalol::CHEMBL380136
SMILES Cc1ccc2CC[C@@H](O)c2c1
InChI Key InChIKey=ATIMDIDJGWMTDD-SNVBAGLBSA-N
Data  2 IC50
  Tab Delimited (TSV)   2D SDfile   Computed 3D by Vconf -m prep SDfile
Find this compound or compounds like it in BindingDB:
Activity Spreadsheet -- Enzyme Inhibition Constant Data from BindingDB
Found 2 hits for monomerid = 50183610
TargetUDP-glucuronosyltransferase 2B7(Homo sapiens (Human))
University Of Helsinki
Curated by ChEMBL
LigandPNGBDBM50183610((+/-)-(R)-6-Methyl-1-indalol | CHEMBL380136)
Affinity DataIC50:  3.94E+5nM. Assay description: Inhibition of UGT2B7
In DepthDetails ArticlePubMed
TargetUDP-glucuronosyltransferase 2B17(Homo sapiens (Human))
University Of Helsinki
Curated by ChEMBL
LigandPNGBDBM50183610((+/-)-(R)-6-Methyl-1-indalol | CHEMBL380136)
Affinity DataIC50:  4.89E+5nM. Assay description: Inhibition of UGT2B17
In DepthDetails ArticlePubMed