BDBM50183733 CHEMBL264119::N-hydroxy-4-((4-((2-methylquinolin-4-yl)methoxy)benzamido)methyl)-1-propylpiperidine-4-carboxamide
SMILES CCCN1CCC(CNC(=O)c2ccc(OCc3cc(C)nc4ccccc34)cc2)(CC1)C(=O)NO
InChI Key InChIKey=GTCRWKBEGBSXDD-UHFFFAOYSA-N
Data  2 IC50
  Tab Delimited (TSV)   2D SDfile   Computed 3D by Vconf -m prep SDfile
Find this compound or compounds like it in BindingDB:
Activity Spreadsheet -- Enzyme Inhibition Constant Data from BindingDB
Found 2 hits for monomerid = 50183733
TargetDisintegrin and metalloproteinase domain-containing protein 17(Homo sapiens (Human))
Bristol-Myers Squibb Pharmaceutical Research Institute
Curated by ChEMBL
LigandPNGBDBM50183733(CHEMBL264119 | N-hydroxy-4-((4-((2-methylquinolin-...)
Affinity DataIC50: >3.00E+3nM. Assay description: Inhibition of LPS-stimulated TNFalpha production in human whole blood
In DepthDetails ArticlePubMed
TargetDisintegrin and metalloproteinase domain-containing protein 17(Sus scrofa (pig))
Bristol-Myers Squibb Pharmaceutical Research Institute
Curated by ChEMBL
LigandPNGBDBM50183733(CHEMBL264119 | N-hydroxy-4-((4-((2-methylquinolin-...)
Affinity DataIC50:  11nM. Assay description: Inhibition of porcine TACE
In DepthDetails ArticlePubMed