BDBM50183774 (2S,3S)-dibenzyl 1-((S)-1-((S)-2-(tert-butoxycarbonyl)-4-methylpentanoyl)azetidine-2-carbonyl)aziridine-2,3-dicarboxylate::CHEMBL208129
SMILES CC(C)C[C@H](NC(=O)OC(C)(C)C)C(=O)N1CC[C@H]1C(=O)N1[C@@H]([C@H]1C(=O)OCc1ccccc1)C(=O)OCc1ccccc1
InChI Key InChIKey=MRCGIJIAIPEQAF-FWEHEUNISA-N
Data  1 KI
  Tab Delimited (TSV)   2D SDfile   Computed 3D by Vconf -m prep SDfile
Find this compound or compounds like it in BindingDB:
Activity Spreadsheet -- Enzyme Inhibition Constant Data from BindingDB
Found 1 hit for monomerid = 50183774
TargetCysteine protease(Trypanosoma brucei rhodesiense)
University Of Wuerzburg
Curated by ChEMBL
LigandPNGBDBM50183774((2S,3S)-dibenzyl 1-((S)-1-((S)-2-(tert-butoxycarbo...)
Affinity DataKi:  800nM. Assay description: Inhibition of Trypanosoma brucei rhodesiense rhodesain
In DepthDetails ArticlePubMed