BDBM50183853 (S)-2-(((4-(3-chloro-2-fluorophenylamino)-7-methoxyquinazolin-6-yl)methyl)(methyl)amino)-4-methoxybutanamide::CHEMBL207445
SMILES COCC[C@H](N(C)Cc1cc2c(Nc3cccc(Cl)c3F)ncnc2cc1OC)C(N)=O
InChI Key InChIKey=KBHNVEWVXSQNJH-SFHVURJKSA-N
Data  13 IC50
  Tab Delimited (TSV)   2D SDfile   Computed 3D by Vconf -m prep SDfile
Find this compound or compounds like it in BindingDB:
Activity Spreadsheet -- Enzyme Inhibition Constant Data from BindingDB
Found 13 hits for monomerid = 50183853
TargetcAMP-dependent protein kinase catalytic subunit alpha/beta/gamma(Homo sapiens (Human))
Astrazeneca
Curated by ChEMBL
LigandPNGBDBM50183853((S)-2-(((4-(3-chloro-2-fluorophenylamino)-7-methox...)
Affinity DataIC50: >1.00E+4nM. Assay description: Inhibition of PKA
In DepthDetails ArticlePubMed
TargetMitogen-activated protein kinase 11/12/13/14(Homo sapiens (Human))
Astrazeneca
Curated by ChEMBL
LigandPNGBDBM50183853((S)-2-(((4-(3-chloro-2-fluorophenylamino)-7-methox...)
Affinity DataIC50: >1.00E+4nM. Assay description: Inhibition of SAP kinase
In DepthDetails ArticlePubMed
TargetMitogen-activated protein kinase 10/8/9(Homo sapiens (Human))
Astrazeneca
Curated by ChEMBL
LigandPNGBDBM50183853((S)-2-(((4-(3-chloro-2-fluorophenylamino)-7-methox...)
Affinity DataIC50: >1.00E+4nM. Assay description: Inhibition of JNK
In DepthDetails ArticlePubMed
TargetRho-associated protein kinase 2(Homo sapiens (Human))
Astrazeneca
Curated by ChEMBL
LigandPNGBDBM50183853((S)-2-(((4-(3-chloro-2-fluorophenylamino)-7-methox...)
Affinity DataIC50: >1.00E+4nM. Assay description: Inhibition of ROCK2
In DepthDetails ArticlePubMed
TargetSerine/threonine-protein kinase Chk1(Homo sapiens (Human))
Astrazeneca
Curated by ChEMBL
LigandPNGBDBM50183853((S)-2-(((4-(3-chloro-2-fluorophenylamino)-7-methox...)
Affinity DataIC50: >1.00E+4nM. Assay description: Inhibition of CHK1
In DepthDetails ArticlePubMed
TargetEpidermal growth factor receptor(Homo sapiens (Human))
Astrazeneca
Curated by ChEMBL
LigandPNGBDBM50183853((S)-2-(((4-(3-chloro-2-fluorophenylamino)-7-methox...)
Affinity DataIC50:  50nM. Assay description: Antiproliferative activity against EGF-stimulated human KB cell line
In DepthDetails ArticlePubMed
TargetSerine/threonine-protein kinase Sgk1(Homo sapiens (Human))
Astrazeneca
Curated by ChEMBL
LigandPNGBDBM50183853((S)-2-(((4-(3-chloro-2-fluorophenylamino)-7-methox...)
Affinity DataIC50: >1.00E+4nM. Assay description: Inhibition of SGK
In DepthDetails ArticlePubMed
TargetTyrosine-protein kinase Lck(Homo sapiens (Human))
Astrazeneca
Curated by ChEMBL
LigandPNGBDBM50183853((S)-2-(((4-(3-chloro-2-fluorophenylamino)-7-methox...)
Affinity DataIC50: >1.00E+4nM. Assay description: Inhibition of LCK
In DepthDetails ArticlePubMed
TargetMitogen-activated protein kinase 1(Homo sapiens (Human))
Astrazeneca
Curated by ChEMBL
LigandPNGBDBM50183853((S)-2-(((4-(3-chloro-2-fluorophenylamino)-7-methox...)
Affinity DataIC50: >1.00E+4nM. Assay description: Inhibition of MAPK
In DepthDetails ArticlePubMed
TargetProto-oncogene tyrosine-protein kinase Src(Homo sapiens (Human))
Astrazeneca
Curated by ChEMBL
LigandPNGBDBM50183853((S)-2-(((4-(3-chloro-2-fluorophenylamino)-7-methox...)
Affinity DataIC50: >1.00E+4nM. Assay description: Inhibition of Src
In DepthDetails ArticlePubMed
TargetGlycogen synthase kinase-3 beta(Homo sapiens (Human))
Astrazeneca
Curated by ChEMBL
LigandPNGBDBM50183853((S)-2-(((4-(3-chloro-2-fluorophenylamino)-7-methox...)
Affinity DataIC50: >1.00E+4nM. Assay description: Inhibition of GSK3-beta
In DepthDetails ArticlePubMed
TargetVascular endothelial growth factor receptor 2(Homo sapiens (Human))
Astrazeneca
Curated by ChEMBL
LigandPNGBDBM50183853((S)-2-(((4-(3-chloro-2-fluorophenylamino)-7-methox...)
Affinity DataIC50: >1.00E+4nM. Assay description: Inhibition of KDR
In DepthDetails ArticlePubMed
TargetEpidermal growth factor receptor(Homo sapiens (Human))
Astrazeneca
Curated by ChEMBL
LigandPNGBDBM50183853((S)-2-(((4-(3-chloro-2-fluorophenylamino)-7-methox...)
Affinity DataIC50:  10nM. Assay description: Inhibition of EGFR in presence of 2 uM ATP
In DepthDetails ArticlePubMed