BDBM50183890 ((R)-2-{(S)-2-[(5-amino-4-carbamimidoyl-thiophen-2-ylmethyl)-carbamoyl]-2,5-dihydro-pyrrol-1-yl}-1-cyclohexylmethyl-2-oxo-ethylamino)-acetic acid::CHEMBL206963
SMILES NC(=N)c1cc(CNC(=O)[C@@H]2C=CCN2C(=O)[C@@H](CC2CCCCC2)NCC(O)=O)sc1N
InChI Key InChIKey=NRQVMRVMPKGSPS-SJORKVTESA-N
Data  1 IC50
  Tab Delimited (TSV)   2D SDfile   Computed 3D by Vconf -m prep SDfile
Find this compound or compounds like it in BindingDB:
Activity Spreadsheet -- Enzyme Inhibition Constant Data from BindingDB
Found 1 hit for monomerid = 50183890
TargetProthrombin(Homo sapiens (Human))
Abbott
Curated by ChEMBL
LigandPNGBDBM50183890(((R)-2-{(S)-2-[(5-amino-4-carbamimidoyl-thiophen-2...)
Affinity DataIC50:  57nM. Assay description: Inhibition of thrombin
In DepthDetails ArticlePubMed