BDBM50183900 CHEMBL3823681
SMILES CC[C@H](C)[C@H](NC(=O)[C@H](CC(C)C)NC(=O)[C@H](Cc1c[nH]c2ccccc12)NC(=O)[C@H](CC(N)=O)NC(=O)[C@@H](NC(=O)[C@H](Cc1ccccc1)NC(=O)[C@H](CC(O)=O)NC(=O)[C@H](CCCNC(N)=N)NC(=O)[C@H](C)NC(=O)[C@H](C)NC(=O)[C@H](CC(C)C)NC(=O)[C@H](CC(N)=O)NC(=O)[C@H](CC(O)=O)NC(=O)[C@H](CC(C)C)NC(=O)[C@@H](NC(=O)[C@@H](NC(=O)[C@H](CC(N)=O)NC(=O)[C@H](CCSC)NC(=O)[C@H](CCC(O)=O)NC(=O)[C@H](CC(O)=O)NC(=O)[C@H](CO)NC(=O)[C@H](Cc1ccccc1)NC(=O)[C@H](CO)NC(=O)CNC(=O)[C@H](CC(O)=O)NC(=O)CNC(=O)[C@@H](N)Cc1cnc[nH]1)[C@@H](C)O)[C@@H](C)CC)[C@@H](C)CC)C(=O)N[C@@H](CCC(N)=O)C(N)=O
InChI Key InChIKey=MOUCZOWNQBZTNK-ACXODTFVSA-N
Data  2 EC50
  Tab Delimited (TSV)   2D SDfile   Computed 3D by Vconf -m prep SDfile
Find this compound or compounds like it in BindingDB:
Activity Spreadsheet -- Enzyme Inhibition Constant Data from BindingDB
Found 2 hits for monomerid = 50183900
TargetGlucagon-like peptide 2 receptor(Homo sapiens (Human))
Ferring Research Institute
Curated by ChEMBL
LigandPNGBDBM50183900(CHEMBL3823681)
Affinity DataEC50:  1.10nM. Assay description: Agonist activity at human GLP2R expressed in HEK293 cells after 5 hrs by luciferase reporter gene assay
In DepthDetails ArticlePubMed
TargetGlucagon-like peptide 1 receptor(Homo sapiens (Human))
Ferring Research Institute
Curated by ChEMBL
LigandPNGBDBM50183900(CHEMBL3823681)
Affinity DataEC50: >1.00E+3nM. Assay description: Agonist activity at human GLP1R expressed in HEK293 cells after 5 hrs by luciferase reporter gene assay
In DepthDetails ArticlePubMed