BDBM50184179 4'-{[5-(4-cyclopentyl-piperazine-1-carbonyl)-pyridin-2-ylamino]-methyl}-3,3'-difluoro-biphenyl-2-carboxylic acid methyl ester::CHEMBL204356
SMILES COC(=O)c1c(F)cccc1-c1ccc(CNc2ccc(cn2)C(=O)N2CCN(CC2)C2CCCC2)c(F)c1
InChI Key InChIKey=ZYFYOPCEMPRIRH-UHFFFAOYSA-N
Data  1 KI
  Tab Delimited (TSV)   2D SDfile   Computed 3D by Vconf -m prep SDfile
Find this compound or compounds like it in BindingDB:
Activity Spreadsheet -- Enzyme Inhibition Constant Data from BindingDB
Found 1 hit for monomerid = 50184179
TargetB1 bradykinin receptor(Homo sapiens (Human))
Merck Research Laboratories
Curated by ChEMBL
LigandPNGBDBM50184179(4'-{[5-(4-cyclopentyl-piperazine-1-carbonyl)-pyrid...)
Affinity DataKi:  1.5nM. Assay description: Binding affinity to human BK1 receptor
In DepthDetails ArticlePubMed