BDBM50184493 CHEMBL203791::N,N-diethyl-3-(6-(2-(6-methylpyridin-2-yl)-5,6-dihydro-4H-pyrrolo[1,2-b]pyrazol-3-yl)-1H-benzo[d]imidazol-1-yl)propan-1-amine::diethyl-(3-{6-[2-(6-methyl-pyridin-2-yl)-5,6-dihydro-4H-pyrrolo[1,2-b]pyrazol-3-yl]-benzoimidazol-1-yl}-propyl)-amine
SMILES CCN(CC)CCCn1cnc2ccc(cc12)-c1c2CCCn2nc1-c1cccc(C)n1
InChI Key InChIKey=FNYQWZISNWTOFA-UHFFFAOYSA-N
Data  5 IC50
  Tab Delimited (TSV)   2D SDfile   Computed 3D by Vconf -m prep SDfile
Find this compound or compounds like it in BindingDB:
Activity Spreadsheet -- Enzyme Inhibition Constant Data from BindingDB
Found 5 hits for monomerid = 50184493
TargetMitogen-activated protein kinase kinase kinase 20(Homo sapiens (Human))
Eli Lilly
Curated by ChEMBL
LigandPNGBDBM50184493(CHEMBL203791 | N,N-diethyl-3-(6-(2-(6-methylpyridi...)
Affinity DataIC50: >2.00E+4nM. Assay description: Inhibition of MLK7
In DepthDetails ArticlePubMed
TargetTGF-beta receptor type-1(Homo sapiens (Human))
Eli Lilly
Curated by ChEMBL
LigandPNGBDBM50184493(CHEMBL203791 | N,N-diethyl-3-(6-(2-(6-methylpyridi...)
Affinity DataIC50:  122nM. Assay description: Inhibition of recombinant human TGFbeta R1 expressed in Sf9 cells
In DepthDetails ArticlePubMed
TargetTGF-beta receptor type-1(Homo sapiens (Human))
Eli Lilly
Curated by ChEMBL
LigandPNGBDBM50184493(CHEMBL203791 | N,N-diethyl-3-(6-(2-(6-methylpyridi...)
Affinity DataIC50:  122nM. Assay description: Inhibition of TGFR1
In DepthDetails ArticlePubMed
TargetTGF-beta receptor type-1(Homo sapiens (Human))
Eli Lilly
Curated by ChEMBL
LigandPNGBDBM50184493(CHEMBL203791 | N,N-diethyl-3-(6-(2-(6-methylpyridi...)
Affinity DataIC50:  100nM. Assay description: Inhibition of TGFbeta R1 induced transcriptional activation of p3TP-Lux in mink Mv1Lu lung cells
In DepthDetails ArticlePubMed
TargetTGF-beta receptor type-2(Homo sapiens (Human))
Eli Lilly
Curated by ChEMBL
LigandPNGBDBM50184493(CHEMBL203791 | N,N-diethyl-3-(6-(2-(6-methylpyridi...)
Affinity DataIC50: >2.00E+4nM. Assay description: Inhibition of recombinant human TGFbeta R2 expressed in Sf9 cells
In DepthDetails ArticlePubMed