BDBM50184543 16-alphaH,17-isovaleryloxy-ent-kauran-19-oic acid::CHEMBL379581
SMILES CC(C)CC(=O)OC[C@H]1C[C@]23C[C@H]1CCC2[C@]1(C)CCC[C@](C)(C1CC3)C(O)=O
InChI Key InChIKey=ZOILZTWSQHWPGH-IMKPKNTNSA-N
Data  1 IC50
  Tab Delimited (TSV)   2D SDfile   Computed 3D by Vconf -m prep SDfile
Find this compound or compounds like it in BindingDB:
Activity Spreadsheet -- Enzyme Inhibition Constant Data from BindingDB
Found 1 hit for monomerid = 50184543
TargetTyrosine-protein phosphatase non-receptor type 1(Homo sapiens (Human))
Korea Research Institute Of Bioscience And Biotechnology
Curated by ChEMBL
LigandPNGBDBM50184543(16-alphaH,17-isovaleryloxy-ent-kauran-19-oic acid ...)
Affinity DataIC50:  7.10E+3nM. Assay description: Inhibition of human recombinant PTP1B
In DepthDetails ArticlePubMed