BDBM50184709 CHEMBL210822::N-(1-ethyl-1H-benzo[d]imidazol-2-yl)-3-nitrobenzamide
SMILES CCn1c(NC(=O)c2cccc(c2)[N+]([O-])=O)nc2ccccc12
InChI Key InChIKey=NDPPMBKASXYIHW-UHFFFAOYSA-N
Data  1 IC50
  Tab Delimited (TSV)   2D SDfile   Computed 3D by Vconf -m prep SDfile
Find this compound or compounds like it in BindingDB:
Activity Spreadsheet -- Enzyme Inhibition Constant Data from BindingDB
Found 1 hit for monomerid = 50184709
TargetInterleukin-1 receptor-associated kinase 4(Homo sapiens (Human))
Amgen
Curated by ChEMBL
LigandPNGBDBM50184709(CHEMBL210822 | N-(1-ethyl-1H-benzo[d]imidazol-2-yl...)
Affinity DataIC50:  2.00E+3nM. Assay description: Inhibition of IRAK4
In DepthDetails ArticlePubMed