BDBM50185273 CHEMBL383656::N-((1H-pyrrol-2-yl)methyl)-2-(5-nitro-1H-indol-3-yl)-2-oxoacetamide
SMILES [O-][N+](=O)c1ccc2[nH]cc(C(=O)C(=O)NCc3ccc[nH]3)c2c1
InChI Key InChIKey=IJTUQWVQOVDSGY-UHFFFAOYSA-N
Data  2 KI
  Tab Delimited (TSV)   2D SDfile   Computed 3D by Vconf -m prep SDfile
Find this compound or compounds like it in BindingDB:
Activity Spreadsheet -- Enzyme Inhibition Constant Data from BindingDB
Found 2 hits for monomerid = 50185273
TargetGamma-aminobutyric acid receptor subunit alpha-1/beta-2/gamma-2(Rattus norvegicus (Rat))
Universit£
Curated by ChEMBL
LigandPNGBDBM50185273(CHEMBL383656 | N-((1H-pyrrol-2-yl)methyl)-2-(5-nit...)
Affinity DataKi:  73.5nM. Assay description: Displacement of [3H]flumazenil from rat GABA-Aalpha1 receptor plus beta-2-gamma-2 in HEK293 cells
In DepthDetails ArticlePubMed
TargetGamma-aminobutyric acid receptor subunit alpha-2/beta-2/gamma-2(Rattus norvegicus (Rat))
Universit£
Curated by ChEMBL
LigandPNGBDBM50185273(CHEMBL383656 | N-((1H-pyrrol-2-yl)methyl)-2-(5-nit...)
Affinity DataKi:  585nM. Assay description: Displacement of [3H]flumazenil from rat GABA-Aalpha2 receptor plus beta-2-gamma-2 in HEK293 cells
In DepthDetails ArticlePubMed