BDBM50185347 3-chloro-1-(3-(4-octylphenoxy)-2-oxopropyl)-1H-indole-5-carboxylic acid::3-chloro-1-[3-(4-octylphenoxy)-2-oxopropyl]indole-5-carboxylic acid::CHEMBL205753
SMILES CCCCCCCCc1ccc(OCC(=O)Cn2cc(Cl)c3cc(ccc23)C(O)=O)cc1
InChI Key InChIKey=DYGWDUYHDIXIJY-UHFFFAOYSA-N
Data  4 IC50
  Tab Delimited (TSV)   2D SDfile   Computed 3D by Vconf -m prep SDfile
Find this compound or compounds like it in BindingDB:
Activity Spreadsheet -- Enzyme Inhibition Constant Data from BindingDB
Found 4 hits for monomerid = 50185347
TargetCytosolic phospholipase A2(Homo sapiens (Human))
University Of MüNster
Curated by ChEMBL
LigandPNGBDBM50185347(3-chloro-1-(3-(4-octylphenoxy)-2-oxopropyl)-1H-ind...)
Affinity DataIC50:  110nM. Assay description: Inhibition of human isolated cPLA2alpha by vescicle assay
In DepthDetails ArticlePubMed
TargetCytosolic phospholipase A2(Homo sapiens (Human))
University Of MüNster
Curated by ChEMBL
LigandPNGBDBM50185347(3-chloro-1-(3-(4-octylphenoxy)-2-oxopropyl)-1H-ind...)
Affinity DataIC50:  110nM. Assay description: Inhibition of cPLA2 from human platelets by RP-HPLC
In DepthDetails ArticlePubMed
TargetCytosolic phospholipase A2(Homo sapiens (Human))
University Of MüNster
Curated by ChEMBL
LigandPNGBDBM50185347(3-chloro-1-(3-(4-octylphenoxy)-2-oxopropyl)-1H-ind...)
Affinity DataIC50:  1.50E+3nM. Assay description: Inhibition of cPLA2alpha activity assessed by A23187-induced arachidonic acid release in human platelet
In DepthDetails ArticlePubMed
TargetCytosolic phospholipase A2(Homo sapiens (Human))
University Of MüNster
Curated by ChEMBL
LigandPNGBDBM50185347(3-chloro-1-(3-(4-octylphenoxy)-2-oxopropyl)-1H-ind...)
Affinity DataIC50:  120nM. Assay description: Inhibition of cPLA2-alpha activity assessed by TPA-induced arachidonic acid release in human platelet
In DepthDetails ArticlePubMed