BDBM50185517 7-(2,6-difluorophenyl)-3-(2-fluorophenyl)-2-((2-methyl-2H-1,2,4-triazol-3-yl)methoxy)pyrazolo[1,5-d][1,2,4]triazine::CHEMBL212323
SMILES Cn1ncnc1COc1nn2c(nncc2c1-c1ccccc1F)-c1c(F)cccc1F
InChI Key InChIKey=COIHYICCVMGEJO-UHFFFAOYSA-N
Data  1 KI
  Tab Delimited (TSV)   2D SDfile   Computed 3D by Vconf -m prep SDfile
Find this compound or compounds like it in BindingDB:
Activity Spreadsheet -- Enzyme Inhibition Constant Data from BindingDB
Found 1 hit for monomerid = 50185517
TargetGamma-aminobutyric acid receptor subunit alpha-3/beta-3/gamma-2(Homo sapiens (Human))
Merck Sharp And Dohme Research Laboratories
Curated by ChEMBL
LigandPNGBDBM50185517(7-(2,6-difluorophenyl)-3-(2-fluorophenyl)-2-((2-me...)
Affinity DataKi:  0.520nM. Assay description: Inhibition of [3H]Ro15-1788 binding to human recombinant GABA-Aalpha3 plus beta3gamma2 receptor expressed in L(tk-) cells
In DepthDetails ArticlePubMed