BDBM50185677 (S)-N-ethyl-N-(1-(3-(4-fluorophenyl)-3-(4-(methylsulfonyl)phenyl)propyl)piperidin-4-yl)-2-(4-(methylsulfonyl)phenyl)acetamide::CHEMBL380005
SMILES CCN(C1CCN(CC[C@@H](c2ccc(F)cc2)c2ccc(cc2)S(C)(=O)=O)CC1)C(=O)Cc1ccc(cc1)S(C)(=O)=O
InChI Key InChIKey=HEQNNPHUJZSSCR-HKBQPEDESA-N
Data  1 IC50
  Tab Delimited (TSV)   2D SDfile   Computed 3D by Vconf -m prep SDfile
Find this compound or compounds like it in BindingDB:
Activity Spreadsheet -- Enzyme Inhibition Constant Data from BindingDB
Found 1 hit for monomerid = 50185677
TargetC-C chemokine receptor type 5(Homo sapiens (Human))
Astrazeneca
Curated by ChEMBL
LigandPNGBDBM50185677((S)-N-ethyl-N-(1-(3-(4-fluorophenyl)-3-(4-(methyls...)
Affinity DataIC50:  46nM. Assay description: Displacement of [125I]MIP-1alpha to human recombinant CCR5 expressed in CHO cells
In DepthDetails ArticlePubMed