BDBM50185704 CHEMBL3824162
SMILES OC(=O)c1cccc(c1)[C@@H]1C[C@H]1c1ccc(OCc2c(onc2-c2c(Cl)cccc2Cl)C2CC2)cc1Cl
InChI Key InChIKey=HWOXGSYLOCRIMO-SFTDATJTSA-N
Data  2 EC50
  Tab Delimited (TSV)   2D SDfile   Computed 3D by Vconf -m prep SDfile
Find this compound or compounds like it in BindingDB:
Activity Spreadsheet -- Enzyme Inhibition Constant Data from BindingDB
Found 2 hits for monomerid = 50185704
TargetBile acid receptor(Homo sapiens (Human))
Phenex Pharmaceuticals
Curated by ChEMBL
LigandPNGBDBM50185704(CHEMBL3824162)
Affinity DataEC50:  18nM. Assay description: Agonist activity at GST-tagged FXR LBD (187 to 472 residues) (unknown origin) assessed as FXR interaction with b-CPSSHSSLTERHKILHRLLQEGSPS-COOH by FR...
In DepthDetails ArticlePubMed
TargetBile acid receptor(Homo sapiens (Human))
Phenex Pharmaceuticals
Curated by ChEMBL
LigandPNGBDBM50185704(CHEMBL3824162)
Affinity DataEC50:  29nM. Assay description: Agonist activity at C-terminal Gal4-tagged human FXR (187 to 472 residues) expressed in HEK-293 cells co-expressing pFRluc by mammalian one hybrid as...
In DepthDetails ArticlePubMed