BDBM50185833 CHEMBL3823457
SMILES C[C@H](N(C)c1nccc(Nc2cc([nH]n2)C2CC2)n1)c1ccc2[nH]ccc2n1
InChI Key InChIKey=GTAKUJFUJVMIPM-LBPRGKRZSA-N
Data  1 KI
  Tab Delimited (TSV)   2D SDfile   Computed 3D by Vconf -m prep SDfile
Find this compound or compounds like it in BindingDB:
Activity Spreadsheet -- Enzyme Inhibition Constant Data from BindingDB
Found 1 hit for monomerid = 50185833
TargetSerine/threonine-protein kinase PAK 1(Homo sapiens (Human))
Genentech
Curated by ChEMBL
LigandPNGBDBM50185833(CHEMBL3823457)
Affinity DataKi:  18nM. Assay description: Inhibition of recombinant human GST-tagged PAK1 kinase domain expressed in baculovirus expression system assessed as suppression of phosphorylation o...
In DepthDetails ArticlePubMed