BDBM50185834 CHEMBL3822986
SMILES C[C@@H](Nc1nccc(Nc2cc([nH]n2)C2CC2)n1)c1ccc2[nH]ccc2n1
InChI Key InChIKey=GUERACYCGKAFOU-LLVKDONJSA-N
Data  1 IC50
  Tab Delimited (TSV)   2D SDfile   Computed 3D by Vconf -m prep SDfile
Find this compound or compounds like it in BindingDB:
Activity Spreadsheet -- Enzyme Inhibition Constant Data from BindingDB
Found 1 hit for monomerid = 50185834
TargetSerine/threonine-protein kinase PAK 1(Homo sapiens (Human))
Genentech
Curated by ChEMBL
LigandPNGBDBM50185834(CHEMBL3822986)
Affinity DataIC50:  685nM. Assay description: Inhibition of recombinant human GST-tagged PAK1 kinase domain expressed in baculovirus expression system assessed as suppression of phosphorylation o...
In DepthDetails ArticlePubMed