BDBM50186059 CHEMBL379061::N-(5-(1,1,1,3,3,3-hexafluoro-2-hydroxypropan-2-yl)thiazol-2-yl)-N-(pyridin-2-ylmethyl)isobutyramide
SMILES CC(C)C(=O)N(Cc1ccccn1)c1ncc(s1)C(O)(C(F)(F)F)C(F)(F)F
InChI Key InChIKey=HZLFDOONUFKNDV-UHFFFAOYSA-N
Data  1 IC50
  Tab Delimited (TSV)   2D SDfile   Computed 3D by Vconf -m prep SDfile
Find this compound or compounds like it in BindingDB:
Activity Spreadsheet -- Enzyme Inhibition Constant Data from BindingDB
Found 1 hit for monomerid = 50186059
TargetMalonyl-CoA decarboxylase, mitochondrial(Homo sapiens (Human))
Chugai Pharma
Curated by ChEMBL
LigandPNGBDBM50186059(CHEMBL379061 | N-(5-(1,1,1,3,3,3-hexafluoro-2-hydr...)
Affinity DataIC50:  187nM. Assay description: Inhibition of MCD
In DepthDetails ArticlePubMed