BDBM50186061 CHEMBL209976::N-(3,4-dichlorobenzyl)-N-(5-(1,1,1,3,3,3-hexafluoro-2-hydroxypropan-2-yl)thiazol-2-yl)isobutyramide
SMILES CC(C)C(=O)N(Cc1ccc(Cl)c(Cl)c1)c1ncc(s1)C(O)(C(F)(F)F)C(F)(F)F
InChI Key InChIKey=XUXKURHNQOEDOH-UHFFFAOYSA-N
Data  1 IC50
  Tab Delimited (TSV)   2D SDfile   Computed 3D by Vconf -m prep SDfile
Find this compound or compounds like it in BindingDB:
Activity Spreadsheet -- Enzyme Inhibition Constant Data from BindingDB
Found 1 hit for monomerid = 50186061
TargetMalonyl-CoA decarboxylase, mitochondrial(Homo sapiens (Human))
Chugai Pharma
Curated by ChEMBL
LigandPNGBDBM50186061(CHEMBL209976 | N-(3,4-dichlorobenzyl)-N-(5-(1,1,1,...)
Affinity DataIC50:  438nM. Assay description: Inhibition of MCD
In DepthDetails ArticlePubMed