BDBM50186090 (S)-2-amino-N-((S)-2-(4-chlorophenyl)-1-cyanoethyl)butanamide::CHEMBL209998
SMILES CC[C@H](N)C(=O)N[C@@H](Cc1ccc(Cl)cc1)C#N
InChI Key InChIKey=AVEAHVRCQRIZOC-RYUDHWBXSA-N
Data  1 IC50
  Tab Delimited (TSV)   2D SDfile   Computed 3D by Vconf -m prep SDfile
Find this compound or compounds like it in BindingDB:
Activity Spreadsheet -- Enzyme Inhibition Constant Data from BindingDB
Found 1 hit for monomerid = 50186090
TargetDipeptidyl peptidase 1(Homo sapiens (Human))
Arpida
Curated by ChEMBL
LigandPNGBDBM50186090((S)-2-amino-N-((S)-2-(4-chlorophenyl)-1-cyanoethyl...)
Affinity DataIC50:  96nM. Assay description: Inhibition of human DPP1
In DepthDetails ArticlePubMed