BDBM50186439 CHEMBL208659::US8618147, 11::propyl 2-(3-(4-hydroxyphenyl)-4,5-dihydroisoxazol-5-yl)acetate
SMILES CCCOC(=O)CC1CC(=NO1)c1ccc(O)cc1
InChI Key InChIKey=YHVTULFMEFGWIM-UHFFFAOYSA-N
Data  2 IC50
  Tab Delimited (TSV)   2D SDfile   Computed 3D by Vconf -m prep SDfile
Find this compound or compounds like it in BindingDB:
Activity Spreadsheet -- Enzyme Inhibition Constant Data from BindingDB
Found 2 hits for monomerid = 50186439
TargetMacrophage migration inhibitory factor(Homo sapiens (Human))
Institute For Medical Research
Curated by ChEMBL
LigandPNGBDBM50186439(CHEMBL208659 | US8618147, 11 | propyl 2-(3-(4-hydr...)
Affinity DataIC50:  4.00E+3nM. Assay description: Inhibition of MIF tautomerase activity
In DepthDetails ArticlePubMed
TargetMacrophage migration inhibitory factor(Mus musculus (Mouse))
The Feinstein Institute For Medical Research
US Patent
LigandPNGBDBM50186439(CHEMBL208659 | US8618147, 11 | propyl 2-(3-(4-hydr...)
Affinity DataIC50:  4.00E+3nMpH: 7.2 T: 2°C. Assay description: MIF tautomerase activity was measured by UV-Visible recording spectrophotometry (SHIMADZU, UV1600U). A fresh stock solution of L-dopachrome methyl es...
In DepthDetails US Patent