BDBM50186745 (S)-2-amino-6-(4-mercaptobutanamido)hexanoic acid::CHEMBL438441
SMILES N[C@@H](CCCCNC(=O)CCCS)C(O)=O
InChI Key InChIKey=CIFNBRLJUGIHGI-QMMMGPOBSA-N
Data  1 KI
  Tab Delimited (TSV)   2D SDfile   Computed 3D by Vconf -m prep SDfile
Find this compound or compounds like it in BindingDB:
Activity Spreadsheet -- Enzyme Inhibition Constant Data from BindingDB
Found 1 hit for monomerid = 50186745
TargetS-ribosylhomocysteine lyase(Bacillus subtilis)
The Ohio State University
Curated by ChEMBL
LigandPNGBDBM50186745((S)-2-amino-6-(4-mercaptobutanamido)hexanoic acid ...)
Affinity DataKi:  4.73E+5nM. Assay description: Inhibition of cobalt substituted Bacillus subtilis LuxS
In DepthDetails ArticlePubMed