BDBM50187209 CHEMBL3828123
SMILES CN1CCC(CC1)OC1c2ccccc2C=Cc2ccccc12
InChI Key InChIKey=XAPVUWUPLDVHBO-UHFFFAOYSA-N
Data  1 IC50
  Tab Delimited (TSV)   2D SDfile   Computed 3D by Vconf -m prep SDfile
Find this compound or compounds like it in BindingDB:
Activity Spreadsheet -- Enzyme Inhibition Constant Data from BindingDB
Found 1 hit for monomerid = 50187209
TargetHistone-lysine N-methyltransferase SETD7(Homo sapiens (Human))
Tokyo Medical And Dental University (Tmdu)
Curated by ChEMBL
LigandPNGBDBM50187209(CHEMBL3828123)
Affinity DataIC50: >1.00E+5nM. Assay description: Inhibition of recombinant SET7/9 (unknown origin) using biotinylated histone H3-derived peptide/SAM as substrate after 60 mins by AlphaLISA assay
In DepthDetails ArticlePubMed